IDIOM Schema
type: Ontology
comment: This is the metadata schema for non-textual objects of the project 'Text Database and Dicitionary of Classic Mayan'
version info: Version 2

relation
type: ObjectProperty
comment: Scope Note as defined by DBpedia.org ontology. http://dbpedia.org/ontology/
range: EpigraphicActor
domain: Relation

P100i died in
type: ObjectProperty
comment: Cardinality Info on Range: max. 1
comment: Scope note as defined by Erlangen CRM 150929 based on CIDOC-CRM 6.2
domain: E21 Person
range: E69 Death

P102 has title
type: ObjectProperty
comment: Scope note as defined by Erlangen CRM 150929 based on CIDOC-CRM 6.2
range: E35 Title
sub property of: P1 is identified by
domain: Artefact

P107i is former or current member of
type: ObjectProperty
comment: Scope note as defined by Erlangen CRM 150929 based on CIDOC-CRM 6.2
domain: E39 Actor
range: E74 Group

P113i was removed by
type: ObjectProperty
comment: Scope note as defined by Erlangen CRM 150929 based on CIDOC-CRM 6.2
range: E80 Part Removal
domain: Artefact

P121 overlaps with
type: ObjectProperty
comment: Scope note as defined by Erlangen CRM 150929 based on CIDOC-CRM 6.2
domain: E53 Place
range: E53 Place

P122 borders with
type: ObjectProperty
comment: Scope note as defined by Erlangen CRM 150929 based on CIDOC-CRM 6.2
range: E53 Place
domain: E53 Place

P12i was present at
type: ObjectProperty
comment: Scope note as defined by Erlangen CRM 150929 based on CIDOC-CRM 6.2
range: E7 Activity
domain: Artefact

P131 is identified by
type: ObjectProperty
comment: Scope note as defined by Erlangen CRM 150929 based on CIDOC-CRM 6.2
sub property of: P1 is identified by

P14 carried out by
type: ObjectProperty
comment: Scope note as defined by Erlangen CRM 150929 based on CIDOC-CRM 6.2
range: E39 Actor
domain: E7 Activity

P1 is identified by
type: ObjectProperty
comment: Scope note as defined by Erlangen CRM 150929 based on CIDOC-CRM 6.2

P22 transferred title to
type: ObjectProperty
comment: Cardinality Info on Range: max. 1
comment: Scope note as defined by Erlangen CRM 150929 based on CIDOC-CRM 6.2
range: E39 Actor
domain: E8 Acquisition

P23 transferred title from
type: ObjectProperty
comment: Cardinality Info on Range: max. 1
comment: Scope note as defined by Erlangen CRM 150929 based on CIDOC-CRM 6.2
range: E39 Actor
domain: E8 Acquisition

P24i changed ownership through
type: ObjectProperty
comment: Scope note as defined by Erlangen CRM 150929 based on CIDOC-CRM 6.2
range: E8 Acquisition
domain: Artefact

P2 has type
type: ObjectProperty
comment: Scope note as defined by Erlangen CRM 150929 based on CIDOC-CRM 6.2

P41i was classified by
type: ObjectProperty
comment: Scope note as defined by Erlangen CRM 150929 based on CIDOC-CRM 6.2
range: E17 Type Assignment
sub property of: P140i was attributed by
domain: Artefact

P42 assigned
type: ObjectProperty
comment: Cardinality Info on Range: exactly 1
comment: Scope note as defined by Erlangen CRM 150929 based on CIDOC-CRM 6.2
domain: E17 Type Assignment
sub property of: P141 assigned
range: ArtefactType

P43 has dimension
type: ObjectProperty
comment: Scope note as defined by Erlangen CRM 150929 based on CIDOC-CRM 6.2
range: E54 Dimension
domain: Artefact

P44 has condition
type: ObjectProperty
comment: Scope note as defined by Erlangen CRM 150929 based on CIDOC-CRM 6.2
range: E3 Condition State
domain: Artefact

P46 is composed of
type: ObjectProperty
comment: Scope note as defined by Erlangen CRM 150929 based on CIDOC-CRM 6.2
range: Artefact
domain: Artefact

P62 depicts
type: ObjectProperty
comment: Scope note as defined by Erlangen CRM 150929 based on CIDOC-CRM 6.2
domain: E22 Man-Made Object
range: Entity

P74 has current or former residence
type: ObjectProperty
comment: Scope note as defined by Erlangen CRM 150929 based on CIDOC-CRM 6.2
domain: E39 Actor
range: E53 Place

P7 took place at
type: ObjectProperty
comment: Cardinality Info on Range: max. 1
comment: Scope note as defined by Erlangen CRM 150929 based on CIDOC-CRM 6.2
range: E53 Place
domain: E5 Event

P87 is identified by
type: ObjectProperty
comment: Scope note as defined by Erlangen CRM 150929 based on CIDOC-CRM 6.2
range: E48 Place Name
domain: E53 Place
sub property of: P1 is identified by

P89 falls within
type: ObjectProperty
comment: Scope note as defined by Erlangen CRM 150929 based on CIDOC-CRM 6.2
domain: E53 Place
range: E53 Place

P98i was born
type: ObjectProperty
comment: Cardinality Info on Range: max. 1
comment: Scope note as defined by Erlangen CRM 150929 based on CIDOC-CRM 6.2
domain: E21 Person
range: E67 Birth

P14 1 in the role of
type: ObjectProperty
comment: Cardinality Info on Range: max. 1
comment: Scope note as defined by Erlangen CRM 150929 based on CIDOC-CRM 6.2. The property "allows the nature of an Actor's participation to be specified."
range: GroupTypeActorRole
domain: PerformingActor

activityType
type: ObjectProperty
comment: Cardinality Info on Range: exactly 1
comment: idiom:activityType is a subproperty of crm:P2_has_type and therefore "allows sub typing of CRM entities - a form of specialisation - through the use of a terminological hierarchy, or thesaurus". In this domain-specfic context, idiom:activityType allows to type a crm:E7_Activity with concepts of idiom:ActivityType.
domain: E7 Activity
sub property of: P2 has type
range: ActivityType

actorNameType
type: ObjectProperty
comment: Cardinality Info on Range: max. 1
comment: idiom:actorNameType is a subproperty of crm:P2_has_type and therefore "allows sub typing of CRM entities - a form of specialisation - through the use of a terminological hierarchy, or thesaurus". In this domain-specfic context, idiom:actorNameType allows to type an crm:E82_Actor_Appellation with concepts of idiom:ActorAppellationType.
domain: E82 Actor Appellation
sub property of: P2 has type
range: ActorAppellationType

additionalIdentifier
type: ObjectProperty
comment: idiom:additionalIdenifier is a subproperty of crm:P1_is_identified_by and therefore "describes the naming or identification of any real world item by a name or any other identifier". In this domain-specific context, idiom:additionalIdentifier asserts zero or more identifier to an idiom:Artefact. Additional identifers of an idiom:Artefact are related to the artefact's history and/or used in context of research to identifiy an idiom:Artefact.
range: E42 Identifier
sub property of: P1 is identified by
domain: Artefact

altActorAppellation
type: ObjectProperty
comment: idiom:altActorAppellation is a subproperty of crm:P131_is_identified_by and therefore "identifies a name used specifically to identify an E39 Actor". In this domai-specific context idiom:altActorAppellation indicates alternative appellations for a crm:E39_Actor.
domain: E39 Actor
range: E82 Actor Appellation
sub property of: P131 is identified by

assignedBy
type: ObjectProperty
comment: idiom:assignedBy is a subproperty of crm:P14_carried_out_by and therefore "describes the active participation of an E39 Actor in an E7 Activity". In this domain-specific context the property describes the participation of a crm:E39_Actor in a crm:E17_Type_Assignment. It specifies the actor responsible for the assignement of the artefact type of a idiom:Artefact.
domain: E17 Type Assignment
range: E39 Actor
sub property of: P14 carried out by

assignedMaterial
type: ObjectProperty
comment: idiom:assignedMaterial is a subproperty of crm:P141_assigned and therefore "indicates the attribute that was assigned". In this domain-specific context the property idiom:assignedShapeType relates the concepts of crm:E57_Material that are assigned to an idiom:Artefact that was assigned by the activity of idiom:MaterialAssignment.
range: E57 Material
sub property of: P141 assigned
domain: MaterialAssignment

assignedShapeType
type: ObjectProperty
comment: idiom:assignedShapeType is a subproperty of crm:P141_assigned and therefore "indicates the attribute that was assigned". In this domain-specific context the property idiom:assignedShapeType relates the concepts of idiom:ArtefactShapeType that are assigned to an idiom:Artefact that was assigned by the activity of idiom:ShapeAssignment.
sub property of: P141 assigned
range: ArtefactShapeType
domain: ShapeAssignment

assignedTechnique
type: ObjectProperty
comment: idiom:assignedTechique is a subproperty of crm:P141_assigned and therefore "indicates the attribute that was assigned". In this domain-specific context the property idiom:assignedTechnique relates the concepts of idiom:Technique that are assigned to an idiom:Artefact that was assigned by the activity of idiom:TechniqueAssignment.
sub property of: P141 assigned
range: Technique
domain: TechniqueAssignment

commissioner
type: ObjectProperty
comment: idiom:commissioner is a subproperty of crm:P14_carried_out_by and therefore "describes the active participation of an E39 Actor in an E7 Activity". In this domain-specific context the property describes the participation of a crm:E39_Actor in a idiom:Dedication. A commissioner is an actor, person or group, responsible for the dedication of a idiom:Artefact.
range: E39 Actor
sub property of: P14 carried out by
domain: Dedication

conditionType
type: ObjectProperty
comment: Cardinality Info on Range: min. 1
comment: idiom:conditionType is a subproperty of crm:P2_has_type and therefore "allows sub typing of CRM entities - a form of specialisation - through the use of a terminological hierarchy, or thesaurus". In this domain-specfic context, idiom:conditionType allows to type an crm:E3_Condition_State with concepts of idiom:ConditionType.
domain: E3 Condition State
sub property of: P2 has type
range: ConditionType

currentCustody
type: ObjectProperty
comment: idiom:currentCustody is a subproperty of crm:P12i_was_present_at and therefore "describes the active or passive presence of an E77 Persistent Item in an E5 Event without implying any specific role". In this domain-specific context idiom:currentCustody indicates that instances of idiom:Artefact are currently held in an idiom:Custody.
sub property of: P12i was present at
domain: Artefact
range: Custody

custodian
type: ObjectProperty
comment: idiom:custodian is a subproperty of crm:P14_carried_out_by and therefore "describes the active participation of an E39 Actor in an E7 Activity". In this domain-specific context the property describes the participation of a crm:E39_Actor in a idiom:Custody. A custodian is an actor, person or group, responsible for the care of a idiom:Artefact.
range: E39 Actor
sub property of: P14 carried out by
domain: Custody

divineTutelary
type: ObjectProperty
comment: idiom:divineTutelary indicates a idiom:EpigraphicActor who is a protective deity for the described idiom:EpigraphicActor.
domain: DivineTutelary
range: EpigraphicActor
sub property of: topObjectProperty

explorer
type: ObjectProperty
comment: idiom:explorer is a subproperty of crm:P14_carried_out_by and therefore "describes the active participation of an E39 Actor in an E7 Activity". In this domain-specific context the property describes the participation of a crm:E39_Actor in a idiom:Discovery. An explorer is an actor, person or group, responsible for the discovery of a idiom:Artefact.
range: E39 Actor
sub property of: P14 carried out by
domain: Discovery

findingSpotOfRemains
type: ObjectProperty
comment: idiom:findingSpotOfRemains is a subproperty of crm:P74.former_or_current_residence and therefore "describes the current or former E53 Place of residence of an E39 Actor". In this domain-specific context the property describes the location (crm:E53_Place), where the human remains of an idiom:EpigraphicActor where found. An example: the human remains of K'inich Janaab' Pakal (idiom:EpigraphicActor) where found in a tomb within the Temple of Inscriptions in Palenque (crm:E53 Place).
range: E53 Place
sub property of: P74 has current or former residence
domain: EpigraphicActor

formerCustody
type: ObjectProperty
comment: idiom:formerCustody is a subproperty of crm:P12i_was_present_at and therefore "describes the active or passive presence of an E77 Persistent Item in an E5 Event without implying any specific role". In this domain-specific context idiom:formerCustody indicates that instances of idiom:Artefact were formerly held in idiom:Custody.
sub property of: P12i was present at
domain: Artefact
range: Custody

groupType
type: ObjectProperty
comment: Cardinality Info on Range: min. 1
comment: idiom:groupType is a subproperty of crm:P2.has_type and therefore "allows sub typing of CRM entities - a form of specialisation - through the use of a terminological hierarchy, or thesaurus". In this domain-specfic context, idiom:groupType allows to type crm:E74_Group with concepts of idiom:ActorRole.
domain: E74 Group
sub property of: P2 has type
range: GroupTypeActorRole

hasActor
type: ObjectProperty
comment: In order to avoid reification, the property idiom:hasActor is used to relate an idiom:PerformingActor to crm:E39_Actor.
range: E39 Actor
domain: PerformingActor

hasArchaeologicalCoordinates
type: ObjectProperty
comment: idiom:hasArcheologicalCoordinates is a subproperty of crm:P87_is_identified_by. The property specifies the appellation of a crm:E53_Place as idiom:ArcheologicalCoordinates.
domain: E53 Place
sub property of: P87 is identified by
range: ArchaeologicalCoordinates

hasGeoreferencePoint
type: ObjectProperty
comment: Cardinality Info on Range: max. 1
comment: idiom:hasGeoreferencePoint is a subproperty of crm:P87_is_identified_by. The property specifies the appellation of a crm:E53_Place as idiom:GeoreferencePoint.
domain: E53 Place
sub property of: P87 is identified by
range: GeoreferencePoint

hasMaterialAssignment
type: ObjectProperty
comment: idiom:hasMaterialAssignment is a sub-property of crm:P140i_was_attributed_by and therefore "indicates an attribute that is assigned to an item". In this domain-specific context the property relates the activity idiom:MaterialAssignment to the idiom:Artefact that is assigned by this activity.
sub property of: P140i was attributed by
domain: Artefact
range: MaterialAssignment

hasShapeAssignment
type: ObjectProperty
comment: idiom:hasShapeAssignment is a sub-property of crm:P140i_was_attributed_by and therefore "indicates an attribute that is assigned to an item". In this domain-specific context the property relates the activity idiom:ShapeAssignment to the idiom:Artefact that is assigned by this activity.
sub property of: P140i was attributed by
domain: Artefact
range: ShapeAssignment

hasTechniqueAssignment
type: ObjectProperty
comment: idiom:hasTechniqueAssignment is a sub-property of crm:P140i_was_attributed_by and therefore "indicates an attribute that is assigned to an item". In this domain-specific context the property relates the activity idiom:TechniqueAssignment to the idiom:Artefact that is assigned by this activity.
sub property of: P140i was attributed by
domain: Artefact
range: TechniqueAssignment

namingRelatedActivity
type: ObjectProperty
comment: idiom:namingRelatedActivity is a subproperty of crm:P12i_was_present_at and therefore "describes the active or passive presence of an E77 Persistent Item in an E5 Event without implying any specific role". In this domain-specific context the property associates a crm:E82_Actor_Appellation to a idiom:Activity, which can be associated to the act of the naming of an idiom:EpigraphicActor. An example is the ruler name Pakal I. (crm:E82 Actor Appellation) is associated with his enthronement (idiom:Activity).
range: E7 Activity
domain: E82 Actor Appellation
sub property of: P12i was present at

orientationOfArtefact
type: ObjectProperty
comment: idiom:orientationOfArtefact is a subproperty of crm:P2_has_type and therefore "allows sub typing of CRM entities - a form of specialisation - through the use of a terminological hierarchy, or thesaurus". In this domain-specfic context the property allows to describe the orientation, position and bonding of a idiom:Artefact during its finding in a idiom:Discovery with concepts of idiom:ArtefactOrientation.
sub property of: P2 has type
range: ArtefactOrientation
domain: Discovery

performedBy
type: ObjectProperty
comment: idiom:performedBy was modeled in order to avoid the use of reification in the IDIOM schema. The property relates an crm:E7_Activity to the class idiom:PerformingActor, which allows to express the specific role of an actor when perfoming in an activity.
domain: E7 Activity
range: PerformingActor

placeType
type: ObjectProperty
comment: Cardinality Info on Range: min. 1
comment: idiom:placeType is a subproperty of crm:P2_has_type and therefore "allows sub typing of CRM entities - a form of specialisation - through the use of a terminological hierarchy, or thesaurus." In this domain-specific context idiom:placeType exclusively types instances of crm:E53_Place with concepts of idiom:PlaceType.
domain: E53 Place
sub property of: P2 has type
range: PlaceType

prefActorAppellation
type: ObjectProperty
comment: Cardinality Info on Range: exactly 1
comment: idiom:prefActorAppellation is a subproperty of crm:P131_is_identified_by and therefore "identifies a name used specifically to identify an E39 Actor". In this domai-specific context idiom:prefActorAppellation indicates the preferred appellation of a crm:E39_Actor.
domain: E39 Actor
range: E82 Actor Appellation
sub property of: P131 is identified by

profession
type: ObjectProperty
comment: idiom:profession is a subproperty of gndo:professionOrOccupation. In this domain-specific context idiom:profession indicates the profession or occupation of a crm:E21_Person.
domain: E21 Person
range: GroupTypeActorRole

relatedActivity
type: ObjectProperty
comment: idiom:relatedActivity is a subproperty of dc:relation. In this domain-specific context the property allows to relate a crm:E5_Event to a crm:E7_Activity. The nature of the relation is not further specified.
domain: E5 Event
range: E7 Activity
sub property of: relation

relationshipChild
type: ObjectProperty
comment: In order to avoid reification, the property idiom:relationshipChild is used to relate an idiom:Parent to an idiom:EpigraphicActor.
range: EpigraphicActor
domain: Parent

relationshipDescendant
type: ObjectProperty
comment: In order to avoid reification, the property idiom:relationshipDescendant is used to relate an idiom:Ancestor to an idiom:EpigraphicActor.
domain: Ancestor
range: EpigraphicActor

relationshipDivineTutelary
type: ObjectProperty
comment: In order to avoid reification, the property idiom:relationshipDivineTutelary is used to relate an idiom:DivineTutelary to an idiom:EpigraphicActor.
domain: DivineTutelary
range: EpigraphicActor

relationshipGrandchild
type: ObjectProperty
comment: In order to avoid reification, the property idiom:relationshipGrandChild is used to relate an idiom:GrandParent to an idiom:EpigraphicActor.
range: EpigraphicActor
domain: GrandParent

relationshipRelation
type: ObjectProperty
comment: In order to avoid reification, the property idiom:relationshipRelation is used to relate an idiom:Relation to an idiom:EpigraphicActor.
range: EpigraphicActor
domain: Relation

relationshipSibling
type: ObjectProperty
comment: In order to avoid reification, the property idiom:relationshipSibling is used to relate an idiom:Sibling to an idiom:EpigraphicActor.
range: EpigraphicActor
domain: Sibling

relationshipSpouse
type: ObjectProperty
comment: In order to avoid reification, the property idiom:relationshipSpouse is used to relate a idiom:Spouse to an idiom:EpigraphicActor.
range: EpigraphicActor
domain: Spouse

sourceChild
type: ObjectProperty
comment: Cardinality Info on Range: max. 1
comment: idiom:sourceChild is a reification of idiom:EpigraphicActor rel:childOf idiom:EpigraphicActor. It is a subpropery of dcterms:isReferencedBy and allows to relate a idiom:Source to the statement indicating which idiom:EpigraphicActor is the child of another idiom:EpigraphicActor.
domain: Parent
range: Source
sub property of: isReferencedBy

sourceDescendant
type: ObjectProperty
comment: Cardinality Info on Range: max. 1
comment: idiom:sourceDescendant is a reification of idiom:EpigraphicActor rel:descendantOf idiom:EpigraphicActor. It is a subpropery of dcterms:isReferencedBy and allows to relate a idiom:Source to the statement indicating which idiom:EpigraphicActor is the descendant of another idiom:EpigraphicActor.
domain: Ancestor
range: Source
sub property of: isReferencedBy

sourceDivineTutelary
type: ObjectProperty
comment: Cardinality Info on Range: max. 1
comment: idiom:sourceDivineTutelary is a reification of idiom:EpigraphicActor rel:descendantOf idiom:EpigraphicActor. It is a subpropery of dcterms:isReferencedBy and allows to relate a idiom:Source to the statement indicating which idiom:EpigraphicActor is the divine tutelary of another idiom:EpigraphicActor.
domain: DivineTutelary
range: Source
sub property of: isReferencedBy

sourceGrandchild
type: ObjectProperty
comment: Cardinality Info on Range: max. 1
comment: idiom:sourceGrandchild is a reification of idiom:EpigraphicActor rel:grandchildOf idiom:EpigraphicActor. It is a subpropery of dcterms:isReferencedBy and allows to relate a idiom:Source to the statement indicating which idiom:EpigraphicActor is the grandchild of another idiom:EpigraphicActor.
domain: GrandParent
range: Source
sub property of: isReferencedBy

sourceRelationship
type: ObjectProperty
comment: Cardinality Info on Range: max. 1
comment: idiom:sourceRelationship is a reification of idiom:EpigraphicActor rel:descendantOf idiom:EpigraphicActor. It is a subpropery of dcterms:isReferencedBy and allows to relate a idiom:Source to the statement indicating which idiom:EpigraphicActor is related to another idiom:EpigraphicActor in an unspecified way.
domain: Relation
range: Source
sub property of: isReferencedBy

sourceSibling
type: ObjectProperty
comment: Cardinality Info on Range: max. 1
comment: idiom:sourceSibling is a reification of idiom:EpigraphicActor rel:siblingOf idiom:EpigraphicActor. It is a subpropery of dcterms:isReferencedBy and allows to relate an instance of idiom:Source to the statement indicating which idiom:EpigraphicActor is a related to another idiom:EpigraphicActor.
domain: Sibling
range: Source
sub property of: isReferencedBy

sourceSpouse
type: ObjectProperty
comment: Cardinality Info on Range: max. 1
comment: idiom:sourceSpouse is a reification of idiom:EpigraphicActor rel:spouseOf idiom:EpigraphicActor. It is a subpropery of dcterms:isReferencedBy and allows to relate a idiom:Source to the statement indicating which idiom:EpigraphicActor is the spouse of another idiom:EpigraphicActor.
range: Source
domain: Spouse
sub property of: isReferencedBy

wasDedicatedBy
type: ObjectProperty
comment: idiom:wasDedicatedBy is a subproperty of crm:P17i_motivated and therefore "describes an item that is reagarded as a reason for carrying out the activity." In this domain-specific context the property describes that a idiom:Artefact motivated the activity of idiom:Dedication.
sub property of: P17i motivated
domain: Artefact
range: Dedication

wasFoundAt
type: ObjectProperty
comment: idiom:wasFoundAt is a subproperty of crm:P12i_was_present_at and therefore "describes the active or passive presence of an E77 Persistent Item in an E5 Event without implying any specific role". In this domain-specific context idiom:wasFoundAt indicates that instances of idiom:Artefact were discovered during an idiom:Discovery.
sub property of: P12i was present at
domain: Artefact
range: Discovery

date
type: ObjectProperty
comment: Cardinality Info on Range: max. 1
comment: Scope note as defined by DCMI Metadata Terms.
domain: E5 Event
range: Date

relation
type: ObjectProperty
comment: Scope note as defined by DCMI Metadata Terms.

source
type: ObjectProperty
comment: Cardinality Info on Range: max. 1
comment: Scope note as defined by DCMI Metadata Terms.
range: E39 Actor

isReferencedBy
type: ObjectProperty
comment: Scope note as defined by DCMI Metadata Terms.
domain: Entity
range: Source

childOf
type: ObjectProperty
comment: Scope note as defined by "RELATIONSHIP: A vocabulary for describing relationships between people". http://purl.org/vocab/relationship
range: EpigraphicActor
domain: Parent

descendantOf
type: ObjectProperty
comment: Scope note as defined by "RELATIONSHIP: A vocabulary for describing relationships between people". http://purl.org/vocab/relationship
domain: Ancestor
range: EpigraphicActor

grandchildOf
type: ObjectProperty
comment: Scope note as defined by "RELATIONSHIP: A vocabulary for describing relationships between people". http://purl.org/vocab/relationship
range: EpigraphicActor
domain: GrandParent

siblingOf
type: ObjectProperty
comment: Scope note as defined by "RELATIONSHIP: A vocabulary for describing relationships between people". http://purl.org/vocab/relationship
range: EpigraphicActor
domain: Sibling

spouseOf
type: ObjectProperty
comment: Scope note as defined by "RELATIONSHIP: A vocabulary for describing relationships between people". http://purl.org/vocab/relationship
range: EpigraphicActor
domain: Spouse

P90 has value
type: DatatypeProperty
comment: Scope note as defined by Erlangen CRM 150929 based on CIDOC-CRM 6.2
domain: E54 Dimension
range: decimal

P91 has unit
type: DatatypeProperty
comment: Scope note as defined by Erlangen CRM 150929 based on CIDOC-CRM 6.2
domain: E54 Dimension
range: Literal

acquisitionType
type: DatatypeProperty
comment: Cardinality Info on Range: exactly 1
comment: idiom:acquisitionType is a subproperty of dc:type and therefore describes "the nature or genre of the resource". In this domain-specific context the property specifies the type of an crm:E8_Acquisition.
domain: E8 Acquisition
sub property of: type
range: Literal

activityTitle
type: DatatypeProperty
comment: Cardinality Info on Range: exactly 1
comment: idiom:activityTitle is a subproperty of dc:title and therefore "a name given to the resource". In this domain-specific context idiom:activityTitle indicates the title of a crm:E7_Activity.
domain: E7 Activity
sub property of: title
range: Literal

actorName
type: DatatypeProperty
comment: Cardinality Info on Range: exactly 1
comment: idiom:actorName is a subproperty of dc:title and therefore "a name given to the resource". In this domain-specific context idiom:actorName is the appellation of a crm:E39_Actor.
domain: E82 Actor Appellation
sub property of: title
range: Literal

archaeologicalCoordinates
type: DatatypeProperty
comment: idiom:archaeologicalCoordinates is a subproperty of crm:P3_has note. In this domain-specific context the property indicates the archaeological coordinates of a crm:E53_Place.
comment: Cardinality Info on Range: max. 1
sub property of: P3 has note
domain: ArchaeologicalCoordinates
range: Literal

artefactTypePreference
type: DatatypeProperty
comment: idiom:artefactTypePreference is a right or false descision answering the question if an instance of idiom:Artefact is the preferred artefact type of the TWKM project. By this the TWKM project defines a research statement by regarding a specific artefact type as the preferred one.
domain: E17 Type Assignment
range: boolean

attributionType
type: DatatypeProperty
comment: Cardinality Info on Range: max. 1
comment: idiom:attributionType is a subproperty of dc:type and therefore indicates the type of the "nature or genre of the resource". In this domain-specific context the property specifies the type of attribution of the given idiom:Source.
domain: Source
sub property of: type
range: Literal

calendarEra
type: DatatypeProperty
comment: Cardinality Info on Range: exactly 1
comment: idiom:calendarEra is a subproperty of dc:type and therefore describes "the nature or genre of the resource". In this domain-specific context the property specifies the era of the given gregorian date: before common era or common era.
domain: Date
sub property of: type
range: Literal

collection
type: DatatypeProperty
comment: idiom:collection is a subproperty of crm:P3_has_note. It allows to mention the collection in which an idiom:Artefact is aggregated in during an idiom:Custody.
comment: Cardinality Info on Range: max. 1
sub property of: P3 has note
domain: Custody
range: Literal

depthRelief
type: DatatypeProperty
comment: Cardinality Info on Range: max. 1
comment: idiom:depthRelief is a subproperty of crm:P90_has_value. The property allows to indicate the depth of a relief of an idiom:Artefact expressed in crm:E54_Dimension.
domain: E54 Dimension
sub property of: P90 has value
range: decimal

diameter
type: DatatypeProperty
comment: Cardinality Info on Range: max. 1
comment: idiom:diameter is a subproperty of crm:P90_has_value. The property allows to indicate the diameter of an idiom:Artefact expressed in crm:E54_Dimension.
domain: E54 Dimension
sub property of: P90 has value
range: decimal

dynasticCount
type: DatatypeProperty
comment: idiom:dynasticCount is a subproperty of crm:P3.has_note.
sub property of: P3 has note
domain: EpigraphicActor
range: Literal

exposureAboveFloor
type: DatatypeProperty
comment: Cardinality Info on Range: max. 1
comment: idiom:exposureAboveFloor is a subproperty of crm:P90_has_value. The property allows to indicate the exposure above the floor of the plain butt of an idiom:Artefact expressed in crm:E54_Dimension.
domain: E54 Dimension
sub property of: P90 has value
range: decimal

formOfExistence
type: DatatypeProperty
comment: Cardinality Info on Range: exactly 1
comment: idiom:formOfExistence is a subproperty of dc:type and therefore describes "the nature or genre of the resource". In this domain-specific context idiom:formOfExistence indicates the form of being (human or mytholoical) of an idiom:EpigraphicActor.
domain: EpigraphicActor
sub property of: type
range: Literal

geonamesID
type: DatatypeProperty
comment: idiom:geonamesID is a subproperty as owl:sameAs. The range is limeted to the URI given by Geonames.
domain: E53 Place
range: anyURI
sub property of: sameAs

gndID
type: DatatypeProperty
comment: idiom:gndID is a subproperty as owl:sameAs. The range is limeted to the URI given by the GND (Gemeinsame Normdatei) of the German National Library.
domain: E39 Actor
range: anyURI
sub property of: sameAs

gregorianDate
type: DatatypeProperty
comment: Cardinality Info on Range: max. 1
comment: idiom:gregorianDate describes a calendar date given in form of the Gregorian calendar system.
domain: Date
range: date

haabInput
type: DatatypeProperty
comment: Cardinality Info on Range: max. 1
comment: idiom:haabInput describes the numeric cooefficient of the Mayan Haab calendar. The Haab calendar is a repeating calendar describing a solar year, consisting of a name for a month and a numeric cooefficient.
domain: Date
range: decimal

haabUnit
type: DatatypeProperty
comment: Cardinality Info on Range: max. 1
comment: idiom:haabUnit describes the name of a month given by the Mayan Haab calendar. The Haab calendar is a repeating calendar describing a solar year, consisting of a name for a month and a numeric cooefficient.
domain: Date
range: Literal

hasConfidenceLevel
type: DatatypeProperty
comment: Cardinality Info on Range: max. 1
comment: idiom:hasConfidenceLevel is a subproperty of dc:type and therefore indicates the type of the "nature or genre of the resource". In this domain-specific context the property specifies the level of certainty of the given idiom:Source.
domain: Source
sub property of: type
range: Literal

hasDigitalObject
type: DatatypeProperty
comment: idiom:hasDigitalObject gives a URI of a digital image representing a idiom:VisualDocument.
range: anyURI

hasUnit
type: DatatypeProperty
comment: Cardinality Info on Range: max. 1
comment: idiom:hasUnit is a subproperty of crm:P91_has_unit. The property shows the type of unit referring to the measured dimension in crm:E54_Dimension.
domain: E54 Dimension
sub property of: P91 has unit
range: Literal

hasUnitWeight
type: DatatypeProperty
comment: Cardinality Info on Range: max. 1
comment: idiom:hasUnitWeight is a subproperty of crm:P90_has_unit. The property shows the type of unit referring to the measured weight expressed in crm:E54_Dimension.
domain: E54 Dimension
sub property of: P91 has unit
range: Literal

height
type: DatatypeProperty
comment: Cardinality Info on Range: max. 1
comment: idiom:height is a subproperty of crm:P90.has_value. The property allows to indicate the height of an idiom:Artefact expressed in crm:E54_Dimension.
domain: E54 Dimension
sub property of: P90 has value
range: decimal

heightButt
type: DatatypeProperty
comment: Cardinality Info on Range: max. 1
comment: idiom:heightButt is a subproperty of crm:P90.has_value. The property allows to indicate the height of the plain butt of an idiom:Artefact expressed in crm:E54_Dimension.
domain: E54 Dimension
sub property of: P90 has value
range: decimal

heightLowCarving
type: DatatypeProperty
comment: Cardinality Info on Range: max. 1
comment: idiom:heightLowCarving is a subproperty of crm:P90.has_value. The property allows to indicate the height above the lowest carving of an idiom:Artefact expressed in crm:E54_Dimension.
domain: E54 Dimension
sub property of: P90 has value
range: decimal

heightSculpturedArea
type: DatatypeProperty
comment: Cardinality Info on Range: max. 1
comment: idiom:heightSculpturedArea is a subproperty of crm:P90_has_value. The property allows to indicate the height of the sculptured area of an idiom:Artefact expressed in crm:E54_Dimension.
domain: E54 Dimension
sub property of: P90 has value
range: decimal

identifier
type: DatatypeProperty
comment: Cardinality Info on Range: exactly 1
comment: idiom:identifier is a subproperty of dc:identifier and therefore is "an unambiguous reference to the resource within a given context". In this domain-specific context, idiom:identifier is a project-specific reference to identify an idiom:Artefact.
domain: Artefact
sub property of: identifier
range: Literal

identifierType
type: DatatypeProperty
comment: Cardinality Info on Range: exactly 1
comment: idiom:identifierType is a subproperty of dc:type and therefore describes "the nature or genre of the resource". In this domain-specific context the property specifies the type of an crm:E42 Identifier.
domain: E42 Identifier
sub property of: type
range: Literal

inSitu
type: DatatypeProperty
comment: idiom:inSitu is a right or false descision answering the question if an instance of idiom:Artefact is still placed at its discovered archaeological site.
domain: Artefact
range: boolean

inventoryNumber
type: DatatypeProperty
comment: Cardinality Info on Range: max. 1
comment: idiom:inventoryNumber is a subproperty of dc:identifier and therefore "an unambiguous reference to the resource within a given context". In this domain-spedific context idiom:inventoryNumber is a local indentification number given to a idiom:VisualDocument by the holding institution, repository or person.
sub property of: identifier
range: Literal

isQualifiedBy
type: DatatypeProperty
comment: idiom:isQualifiedBy is a subproperty of crm:P3_has_note. In this domain-specific context the property allows to specifiy the precision of the given idiom:Date.
comment: Cardinality Info on Range: exactly 1
sub property of: P3 has note
domain: Date
range: Literal

longcount
type: DatatypeProperty
comment: Cardinality Info on Range: max. 1
comment: idiom:longcount describes a calendar date given in form of the Long Count of the Mayan calendar system. The Long Count is a non-repeating calendar counting the number of days passed since the mythical creation date of the Maya.
domain: Date
range: Literal

noteId
type: DatatypeProperty
comment: Cardinality Info on Range: exactly 1
comment: idiom:noteId is a subproperty of crm:P3_has_note. In this domain-specific context the property indicates the identifier of a crm:E42_Identifier.
domain: E42 Identifier
sub property of: P3 has note
range: Literal

perimeter
type: DatatypeProperty
comment: Cardinality Info on Range: max. 1
comment: idiom:perimeter is a subproperty of crm:P90_has_value. The property allows to indicate the perimeter of an idiom:Artefact expressed in crm:E54_Dimension.
domain: E54 Dimension
sub property of: P90 has value
range: decimal

placeName
type: DatatypeProperty
comment: Cardinality Info on Range: exactly 1
comment: idiom:placeName is a subproperty of dc:title and therefore "a name given to the resource". In this domain-specific context idiom:placeName is the appellation of a crm:E53_Place.
domain: E48 Place Name
sub property of: title
range: Literal

placeNameType
type: DatatypeProperty
comment: Cardinality Info on Range: exactly 1
comment: idiom:placeNameType is a subproperty of dc:type and therefore describes "the nature or genre of the resource". In this domain-specific context the property specifies the type of an crm:E48_Place Name.
domain: E48 Place Name
sub property of: type
range: Literal

positionOfArtefact
type: DatatypeProperty
comment: Cardinality Info on Range: max. 1
comment: idiom:positionOfArtefact is a subproperty of crm:P3_has_note. In this domain-specific context the property allows to give a description of the position of the idiom:Artefact found during the described idiom:Discovery. Examples are "in front of the buildng A", "on the plaza", "inside the burial chamber".
sub property of: P3 has note
domain: Discovery
range: Literal

preferredTitle
type: DatatypeProperty
comment: Cardinality Info on Range: exactly 1
comment: idiom:preferredTitle is a subproperty of dc:title and therefore "a name given to the resource". In this domain-specific context idiom:preferredTitle is the preferred title of an idiom:Artefact.﻿
domain: Artefact
sub property of: title
range: Literal

secondaryFindingContext
type: DatatypeProperty
comment: idiom:secondaryFindingContext indicates if a idiom:Artefact found in the described idiom:Discovery is or is not placed at its original location.
domain: Discovery
range: boolean

shows
type: DatatypeProperty
comment: idiom:isShownBy is a subproperty of crm:P62i_is_depicted_by and therefore "identifies something that is depicted by an instance of E24 Physical Man-Made Thing" (the superclass of E22 Man-Made Object). In this domian-specific context, idiom:isShownBy identifies a resource with an URI.
domain: Artefact
range: anyURI

tgnID
type: DatatypeProperty
comment: idiom:tgnID is a subproperty as owl:sameAs. The range is limeted to the URI given by the TGN (Thesaurus of Geographic Names) of the Getty Research Insitute.
domain: E53 Place
range: anyURI
sub property of: sameAs

thickness
type: DatatypeProperty
comment: Cardinality Info on Range: max. 1
comment: idiom:thickness is a subproperty of crm:P90.has_value. The property allows to indicate the thickness of an idiom:Artefact expressed in crm:E54_Dimension.
domain: E54 Dimension
sub property of: P90 has value
range: decimal

title
type: DatatypeProperty
comment: Cardinality Info on Range: exactly 1
comment: idiom:title is a subproperty of dc:title and therefore "a name given to the resource". In this domain-specific context idiom:title is the appellation of a idiom:Artefact.
domain: E35 Title
sub property of: title
range: Literal

titleType
type: DatatypeProperty
comment: Cardinality Info on Range: exactly 1
comment: idiom:titleType is a subproperty of dc:type and therefore describes "the nature or genre of the resource". In this domain-specific context the property specifies the type of an crm:E35_Title.
domain: E35 Title
sub property of: type
range: Literal

typeOfView
type: DatatypeProperty
comment: Cardinality Info on Range: max. 1
comment: idiom:typeOfView is a subproperty of dc:type and therefore describes "the nature or genre of the resource". In this domain-specific context idiom:typeOfView specifies the type of how instances of idiom:Artefact are shown on instances of idiom:VisualDocument. Examples are "front view", "left side", "top".
sub property of: type
range: Literal

tzolkinInput
type: DatatypeProperty
comment: Cardinality Info on Range: max. 1
comment: idiom:tzolkinInput describes the numeric cooefficient of the Mayan Tzolkin calendar. The Tzolkin calendar is a repeating calendar describing 260 days, consisting of a name for a day and a numeric cooefficient.
domain: Date
range: decimal

tzolkinUnit
type: DatatypeProperty
comment: Cardinality Info on Range: max. 1
comment: idiom:tzolkinUnit describes the name of a day given by the Mayan Tzolkin calendar. The Tzolkin calendar is a repeating calendar describing 260 days, consisting of a name for a day and a numeric cooefficient.
domain: Date
range: Literal

visualDocumentTitle
type: DatatypeProperty
comment: Cardinality Info on Range: max. 1
comment: idiom:visualDocumentTitle is a subproperty of dc:title and therefore "a name given to the resource". In this domain-specific context idiom:visualDocumentTitle is the title of an idiom:VisualDocument.
sub property of: title
range: Literal

visualDocumentType
type: DatatypeProperty
comment: Cardinality Info on Range: exactly 1
comment: idiom:visualDocumentType is a subproperty of dc:type and therefore describes "the nature or genre of the resource". In this domain-specific context the property specifies the type of an idiom:VisualDocument. Examples are "photo", "dia", "drawing".
sub property of: type
range: Literal

weight
type: DatatypeProperty
comment: Cardinality Info on Range: max. 1
comment: idiom:weight is a subproperty of crm:P90_has_value. The property allows to indicate the weight of an idiom:Artefact expressed in crm:E54_Dimension.
domain: E54 Dimension
sub property of: P90 has value
range: decimal

width
type: DatatypeProperty
comment: Cardinality Info on Range: max. 1
comment: idiom:width is a subproperty of crm:P90_has_value. The property allows to indicate the width of an idiom:Artefact expressed in crm:E54_Dimension.
domain: E54 Dimension
sub property of: P90 has value
range: decimal

widthBaseCarving
type: DatatypeProperty
comment: Cardinality Info on Range: max. 1
comment: idiom:widthBaseCarving is a subproperty of crm:P90_has_value. The property allows to indicate the width at the base of the carving of an idiom:Artefact expressed in crm:E54_Dimension.
domain: E54 Dimension
sub property of: P90 has value
range: decimal

widthSculpturedArea
type: DatatypeProperty
comment: Cardinality Info on Range: max. 1
comment: idiom:widthSculpturedArea is a subproperty of crm:P90_has_value. The property allows to indicate the width of the sculptured area of an idiom:Artefact expressed in crm:E54_Dimension.
domain: E54 Dimension
sub property of: P90 has value
range: decimal

creator
type: DatatypeProperty
comment: Cardinality Info on Range: max. 1
comment: Scope note as defined by DCMI Metadata Terms.
range: Literal

description
type: DatatypeProperty
comment: Scope note as defined by DCMI Metadata Terms.
domain: Entity
range: string

identifier
type: DatatypeProperty
comment: Scope note as defined by DCMI Metadata Terms.

rights
type: DatatypeProperty
comment: Scope note as defined by DCMI Metadata Terms.
range: Literal

title
type: DatatypeProperty
comment: Scope note as defined by DCMI Metadata Terms.

type
type: DatatypeProperty
comment: Scope note as defined by DCMI Metadata Terms.

bibliographicCitation
type: DatatypeProperty
comment: Cardinality Info on Range: max. 1
comment: Scope note as defined by DCMI Metadata Terms.
domain: Source
range: Literal

date
type: DatatypeProperty
comment: Cardinality Info on Range: max. 1
comment: Scope note as defined by DCMI Metadata Terms.
range: Literal

alternateName
type: DatatypeProperty
comment: Scope note as defined by schema.org version 2.2.
domain: NonEpigraphicGroup
range: Literal

birthDate
type: DatatypeProperty
comment: Cardinality Info on Range: max. 1
comment: Scope note as defined by schema.org version 2.2.
domain: NonEpigraphicPerson
range: date

deathDate
type: DatatypeProperty
comment: Cardinality Info on Range: max. 1
comment: Scope note as defined by schema.org version 2.2.
domain: NonEpigraphicPerson
range: date

familyName
type: DatatypeProperty
comment: Cardinality Info on Range: max. 1
comment: Scope note as defined by schema.org version 2.2.
domain: NonEpigraphicPerson
range: Literal

gender
type: DatatypeProperty
comment: Cardinality Info on Range: max. 1
comment: Scope note as defined by schema.org version 2.2.
domain: E21 Person
range: Literal

givenName
type: DatatypeProperty
comment: Cardinality Info on Range: max. 1
comment: Scope note as defined by schema.org version 2.2.
domain: NonEpigraphicPerson
range: Literal

name
type: DatatypeProperty
comment: Cardinality Info on Range: exactly 1
comment: Scope note as defined by schema.org version 2.2.
domain: NonEpigraphicGroup
range: Literal

pagination
type: DatatypeProperty
comment: Cardinality Info on Range: max. 1
comment: Scope note as defined by schema.org version 2.2.
domain: Source
range: Literal

sameAs
type: DatatypeProperty
comment: Scope note as defined by W3C OWL Web Ontology Language. https://www.w3.org/TR/owl-ref/

alt
type: DatatypeProperty
comment: Cardinality Info on Range: max. 1
comment: Scope note as defined by Basic Geo (WGS84 lat/long) Vocabulary of W3C Semantic Web Interest Group. https://www.w3.org/2003/01/geo/
domain: GeoreferencePoint
range: decimal

lat
type: DatatypeProperty
comment: Cardinality Info on Range: max. 1
comment: Scope note as defined by Basic Geo (WGS84 lat/long) Vocabulary of W3C Semantic Web Interest Group. https://www.w3.org/2003/01/geo/
domain: GeoreferencePoint
range: decimal

long
type: DatatypeProperty
comment: Cardinality Info on Range: max. 1
comment: Scope note as defined by Basic Geo (WGS84 lat/long) Vocabulary of W3C Semantic Web Interest Group. https://www.w3.org/2003/01/geo/
domain: GeoreferencePoint
range: decimal

E17 Type Assignment
type: Class
subclass of: E13 Attribute Assignment
comment: Scope note as defined by Erlangen CRM 150929 based on CIDOC-CRM 6.2

E21 Person
type: Class
subclass of: E39 Actor
comment: Scope note as defined by Erlangen CRM 150929 based on CIDOC-CRM 6.2

E22 Man-Made Object
type: Class
subclass of: Entity
comment: Scope note as defined by Erlangen CRM 150929 based on CIDOC-CRM 6.2

E35 Title
type: Class
subclass of: E41 Appellation
comment: Scope note as defined by Erlangen CRM 150929 based on CIDOC-CRM 6.2

E39 Actor
type: Class
subclass of: Entity
comment: Scope note as defined by Erlangen CRM 150929 based on CIDOC-CRM 6.2

E3 Condition State
type: Class
subclass of: Entity
comment: Scope note as defined by Erlangen CRM 150929 based on CIDOC-CRM 6.2

E41 Appellation
type: Class
subclass of: Entity
comment: Scope note as defined by Erlangen CRM 150929 based on CIDOC-CRM 6.2

E42 Identifier
type: Class
subclass of: E41 Appellation
comment: Scope note as defined by Erlangen CRM 150929 based on CIDOC-CRM 6.2

E44 Place Appellation
type: Class
subclass of: E41 Appellation
comment: Scope note as defined by Erlangen CRM 150929 based on CIDOC-CRM 6.2

E47 Spatial Coordinates
type: Class
subclass of: E41 Appellation
comment: Scope note as defined by Erlangen CRM 150929 based on CIDOC-CRM 6.2

E48 Place Name
type: Class
subclass of: E44 Place Appellation
comment: Scope note as defined by Erlangen CRM 150929 based on CIDOC-CRM 6.2

E53 Place
type: Class
subclass of: Entity
comment: Scope note as defined by Erlangen CRM 150929 based on CIDOC-CRM 6.2

E54 Dimension
type: Class
subclass of: Entity
comment: Scope note as defined by Erlangen CRM 150929 based on CIDOC-CRM 6.2

E55 Type
type: Class
subclass of: Entity
comment: Scope note as defined by Erlangen CRM 150929 based on CIDOC-CRM 6.2

E57 Material
type: Class
subclass of: E55 Type
comment: Scope note as defined by Erlangen CRM 150929 based on CIDOC-CRM 6.2

E5 Event
type: Class
subclass of: Entity
comment: Scope note as defined by Erlangen CRM 150929 based on CIDOC-CRM 6.2

E67 Birth
type: Class
subclass of: E5 Event
comment: Scope note as defined by Erlangen CRM 150929 based on CIDOC-CRM 6.2

E69 Death
type: Class
subclass of: E5 Event
comment: Scope note as defined by Erlangen CRM 150929 based on CIDOC-CRM 6.2

E73 Information Object
type: Class
subclass of: Entity
comment: Scope note as defined by Erlangen CRM 150929 based on CIDOC-CRM 6.2

E74 Group
type: Class
subclass of: E39 Actor
comment: Scope note as defined by Erlangen CRM 150929 based on CIDOC-CRM 6.2

E7 Activity
type: Class
subclass of: E5 Event
comment: Scope note as defined by Erlangen CRM 150929 based on CIDOC-CRM 6.2

E80 Part Removal
type: Class
subclass of: E7 Activity
comment: Scope note as defined by Erlangen CRM 150929 based on CIDOC-CRM 6.2

E82 Actor Appellation
type: Class
subclass of: E41 Appellation
comment: Scope note as defined by Erlangen CRM 150929 based on CIDOC-CRM 6.2

E8 Acquisition
type: Class
subclass of: E7 Activity
comment: Scope note as defined by Erlangen CRM 150929 based on CIDOC-CRM 6.2

ActivityType
type: Class
subclass of: E55 Type
comment: This class is subclass of crm:E55 Type an therefore "comprises concepts denoted by terms from thesauri and controlled vocabularies used to characterize and classify instances of CRM classes". In this domain-specific context idiom:ActivityType comprisies concepts referring to the type of a idiom:Activity. Examples are: "destruction", "war", "wedding", "accession", "modification", "exhibition".

ActorAppellationType
type: Class
subclass of: E55 Type
comment: This class is subclass of crm:E55_Type an therefore "comprises concepts denoted by terms from thesauri and controlled vocabularies used to characterize and classify instances of CRM classes". In this domain-specific context idiom:ActorAppellationType comprisies concepts referring to the type of appellation of an crm:E39 Actor. Examples for appellation types are "birth name", "death name", "dynasty name".

Ancestor
type: Class
comment: Due to research practices, it is necessary to reference the relationship between Epigraphic Actors with a literary source. In order to avoid the use of reification in the IDIOM schema, the classes idiom:Parent/GrandParent/Sibling/Spouse/Ancestor/DivineTutelary/UnspecifiedRelationship were modeled. The classes indicate the nature of the relationship between two or more instances of idiom:Epigraphic Actor (e.g. parent, spouse, sibling etc.). These classes allow to give a idiom:Source to each relationship statement.

ArchaeologicalCoordinates
type: Class
subclass of: E44 Place Appellation
comment: This class is a subclass of crm:E44_Place_Appellation and therefore "comprises any sort of identifier characteristically used to refer to an crm:E53_Place". In this domain-specific context idiom:ArchaeologicalCoordinates referring to identifier used in an archaeological or excavation context to identify a certain crm:E53_Place by using a reference system regarding archaeological practices.

Artefact
type: Class
subclass of: E22 Man-Made Object
comment: This class is subclass of crm:E22_Man-Made_Object and therefore describes "physical objects purposely created by human activity". In this domain-specific context idiom:Artefact describes all artificially crafted objects of Classic Mayan society that may or may not carry epigraphic content, an inscription and/or visual information. It differs from crm:E84_Information_Carrier, because an idiom:Artefact is not stringently required to be specifically designed for the purpose to carry information. Examples are (1) the Temple of the Cross of Palenque, (2) Yaxchilan Lintel 8.

ArtefactOrientation
type: Class
subclass of: E55 Type
comment: This class is subclass of crm:E55_Type an therefore "comprises concepts denoted by terms from thesauri and controlled vocabularies used to characterize and classify instances of CRM classes". In this domain-specific context idiom:ArtefactOrientation comprisies concepts specifiing the orientation of a idiom:Artefact as observed at a idiom:Discovery.

ArtefactShapeType
type: Class
subclass of: E55 Type
comment: This class is subclass of crm:E55_Type an therefore "comprises concepts denoted by terms from thesauri and controlled vocabularies used to characterize and classify instances of CRM classes". In this domain-specific context idiom:ArtefactShapeType comprisies concepts referring to the shape of an idiom:Artefact.

ArtefactType
type: Class
subclass of: E55 Type
comment: This class is subclass of crm:E55_Type an therefore "comprises concepts denoted by terms from thesauri and controlled vocabularies used to characterize and classify instances of CRM classes". In this domain-specific context idiom:ArtefactType comprisies concepts referring to the type of an idiom:Artefact. Examples are "stela", "altar", "bowl".

ConditionType
type: Class
subclass of: E55 Type
comment: This class is subclass of crm:E55_Type an therefore "comprises concepts denoted by terms from thesauri and controlled vocabularies used to characterize and classify instances of CRM classes". In this domain-specific context idiom:ConditionType comprisies concepts referring to the physical state of a idiom:Artefact. Exmaples are "restored", "abraded", "painted over".

Custody
type: Class
subclass of: E7 Activity
comment: This class is a subclass of crm:E7_Activity and therefore "comprises actions intentionally carried out by instances of E39_Actor that result in changes of state in the cultural, social, or physical systems documented." In this domain-specific context idiom:Custody describes periods, where instances of idiom:Artefact are hold by a crm:E39_Actor. It differs from crm:E10_Transfer of Custody, because it does not describe the act of transferring objects, but the period in which the objects are hold. This allows to assign instances of idiom:Artefact to a collection of the holding institution or person. An example: Jade plaque of a Maya king (idiom:Artefact) is in custodial care (idiom:Custody) of the British Museum (crm:E39 Actor) and is part of the Maya Collection.

Date
type: Class
subclass of: Entity
comment: idiom:Date allows to assign calendar dates representing a time span to crm:E5_Event. Due to research practices idiom:Date consits of dates used by the Mayan calendar system (Long Count and Calendar Round) and by the Gregorian calendar system, as both can be converted to one another.

Discovery
type: Class
subclass of: E7 Activity
comment: This class is a subclass of crm:E7_Activity and therefore "comprises actions intentionally carried out by instances of E39_Actor that result in changes of state in the cultural, social, or physical systems documented." In this domain-specific context idiom:Discovery describes the act of finding instances of idiom:Artefact by a crm:E39_Actor. Examples are (1) the discovery (idiom:Discovery) of the Yaxchilan Lintel 8 (idiom:Artefact) by Teobert Maler (idiom:NonEpigraphicPerson); (2) the discovery (idiom:Discovery) of Coba Stela 1 (idiom:Artefact) by the Third CIW Coba Expedition Group (idiom:NonEpigraphicGroup).

DivineTutelary
type: Class
comment: Due to research practices, it is necessary to reference the relationship between Epigraphic Actors with a literary source. In order to avoid the use of reification in the IDIOM schema, the classes idiom:Parent/GrandParent/Sibling/Spouse/Ancestor/DivineTutelary/UnspecifiedRelationship were modeled. The classes indicate the nature of the relationship between two or more instances of idiom:Epigraphic Actor (e.g. parent, spouse, sibling etc.). These classes allow to give a idiom:Source to each relationship statement.

Entity
type: Class
comment: This class comprises all things in the scope of discourse of the IDIOM metadata schema.

EpigraphicActor
type: Class
subclass of: E21 Person
disjoint with: NonEpigraphicPerson
comment: This class is a subclass of crm:E21_Person and therefore "comprises real persons who live or are assumed to have lived." In this domain-specific context the existence of an idiom:EpigraphicActor is proved by epigraphic evidence manifested in instances of idiom:EpigraphicInformationObject. This includes persons who were part of Classic Mayan society, such as kings, priests, scribes and scupltors as well as agents who where part of Classic Mayan mythology such as deities and mythological creatures. idiom:EpigraphicActor is disjoint from idiom:NonEpigraphicPerson. Examples are: (1) K'inich Janaab' Pakal (March 603 – August 683); (2) Itzamna (the name of an upper god and creator deity thought to be residing in the sky).

EpigraphicGroup
type: Class
subclass of: E74 Group
disjoint with: NonEpigraphicGroup
comment: This class is a subclass of crm:E74_Group and therefore "comprises any gatherings or organizations of two or more people that act collectively or in a similar way due to any form of unifying relationship". In this domain-specific context the existence of an idiom:EpigraphicGroup is proved by epigraphic evidence manifested in instances of idiom:EpigraphicInformationObject. This includes groups who where part of Classic Mayan society, such as ruler familiy or dynasty, priests, scribe and scupltor schools as well as agents who where part of Classic Mayan mythology such as deities and mythological creatures. idiom:EpigraphicGroup is disjoint from idiom:NonEpigraphicGroup.

GeoreferencePoint
type: Class
subclass of: E47 Spatial Coordinates
comment: This class is a subclass of crm:E47_Spatial_Coordinates and therefore "comprises the textual or numeric information required to locate specific instances of crm:E53 Place within schemes of spatial identification". In this domain-specific context idiom:GeoreferencePoint referring to coordinitates specified by the World Geodetic System 1984 (WGS84) used for the identification of a crm:E53_Place as a single point, more precisely a longitude, a latitude and if applicable an altitude coordinate.

GrandParent
type: Class
comment: Due to research practices, it is necessary to reference the relationship between Epigraphic Actors with a literary source. In order to avoid the use of reification in the IDIOM schema, the classes idiom:Parent/GrandParent/Sibling/Spouse/Ancestor/DivineTutelary/UnspecifiedRelationship were modeled. The classes indicate the nature of the relationship between two or more instances of idiom:Epigraphic Actor (e.g. parent, spouse, sibling etc.). These classes allow to give a idiom:Source to each relationship statement.

GroupTypeActorRole
type: Class
subclass of: E55 Type
comment: This class is subclass of crm:E55_Type an therefore "comprises concepts denoted by terms from thesauri and controlled vocabularies used to characterize and classify instances of CRM classes". In this domain-specific context idiom:GroupTypeActorRole comprisies concepts specifying the role of a crm:E39_Actor during the performance of a crm:E7_Activity. Examples are "king", "sculptor", "warrior", "captive". It also comprises concepts specifying the type of a crm:E74_Group.

NonEpigraphicGroup
type: Class
subclass of: E74 Group
comment: This class is a subclass of crm:E74_Group and therefore "comprises any gatherings or organizations of two or more people that act collectively or in a similar way due to any form of unifying relationship". In this domain-specific context instances of idiom:NonEpigraphicGroup are part of post Mayan society and therefore are not mentioned in epigraphic texts of Classic Mayan society. Examples are: (1) Third CIW Coba Expedition Group; (2) The British Museum.

NonEpigraphicPerson
type: Class
subclass of: E21 Person
comment: This class is a subclass of crm:E21_Person and therefore "comprises real persons who live or are assumed to have lived." In this domain-specific context instances of idiom:NonEpigraphicPerson are part of post Mayan society and therefore are not mentioned in epigraphic texts of Classic Mayan. Examples are: Teobert Maler (1842 - 1917, a scholar who discovered mayan artefacts), Ernst Förstemann (1822 - 1906, a historian who encoded the Dresden Codex).

Parent
type: Class
comment: Due to research practices, it is necessary to reference the relationship between Epigraphic Actors with a literary source. In order to avoid the use of reification in the IDIOM schema, the classes idiom:Parent/GrandParent/Sibling/Spouse/Ancestor/DivineTutelary/UnspecifiedRelationship were modeled. The classes indicate the nature of the relationship between two or more instances of idiom:Epigraphic Actor (e.g. parent, spouse, sibling etc.). These classes allow to give a idiom:Source to each relationship statement.

PerformingActor
type: Class
comment: The class idiom:PerformingActor was modeled in order to avoid the use of reification in the IDIOM schema. The class allows to express the specific role of an actor when performing in an activity.

PlaceType
type: Class
subclass of: E55 Type
comment: This class is subclass of crm:E55_Type an therefore "comprises concepts denoted by terms from thesauri and controlled vocabularies used to characterize and classify instances of CRM classes". In this domain-specific context idiom:PlaceType comprisies concepts referring to the type of a crm:E53_Place.

Relation
type: Class
comment: Due to research practices, it is necessary to reference the relationship between Epigraphic Actors with a literary source. In order to avoid the use of reification in the IDIOM schema, the classes idiom:Parent/GrandParent/Sibling/Spouse/Ancestor/DivineTutelary/UnspecifiedRelationship were modeled. The classes indicate the nature of the relationship between two or more instances of idiom:Epigraphic Actor (e.g. parent, spouse, sibling etc.). These classes allow to give a idiom:Source to each relationship statement.

Sibling
type: Class
comment: Due to research practices, it is necessary to reference the relationship between Epigraphic Actors with a literary source. In order to avoid the use of reification in the IDIOM schema, the classes idiom:Parent/GrandParent/Sibling/Spouse/Ancestor/DivineTutelary/UnspecifiedRelationship were modeled. The classes indicate the nature of the relationship between two or more instances of idiom:Epigraphic Actor (e.g. parent, spouse, sibling etc.). These classes allow to give a idiom:Source to each relationship statement.

Source
type: Class
subclass of: E73 Information Object
comment: This class is a subclass of crm:E73_Information_Object and therefore "describes identifiable immaterial items [...] that have an objectively recognizable structure and are documented as single units." In this domain-specfic context idiom:Source is a reference in form of a bibliographic citation. This reference is used as evidence for assertions about entities described by the schema.

Spouse
type: Class
comment: Due to research practices, it is necessary to reference the relationship between Epigraphic Actors with a literary source. In order to avoid the use of reification in the IDIOM schema, the classes idiom:Parent/GrandParent/Sibling/Spouse/Ancestor/DivineTutelary/UnspecifiedRelationship were modeled. The classes indicate the nature of the relationship between two or more instances of idiom:Epigraphic Actor (e.g. parent, spouse, sibling etc.). These classes allow to give a idiom:Source to each relationship statement.

Technique
type: Class
subclass of: E55 Type
comment: This class is subclass of crm:E55_Type an therefore "comprises concepts denoted by terms from thesauri and controlled vocabularies used to characterize and classify instances of CRM classes". In this domain-specific context idiom:Technique comprisies concepts referring to the technique used during a crm:E12_Production of an idiom:Artefact.